{"text_format":"1","workbook":"xlsx","n_sheets":7,"sheets":["様式1号（基本情報）","様式2号（認証チェックシート）","様式3号（今後の重点目標）","【評価】_②認証チェックシート","【評価】診断結果計算シート","【評価】第4号様式_結果通知書","（非表示シート）BCI列プルダウン"],"not_rendered":{"charts":4,"images":28,"macros":1,"external_links":3,"defined_names":28,"comments":3,"pivot_tables":0},"unopened":[],"bounds":{"document_bytes":16777216,"sheet_cells":100000,"rows_first":2000,"rows_last":500,"rows_between":2000,"halvings":0,"cell_chars":16384,"cell_head_chars":4096},"cells_cut":0,"cells_raw":0,"read":"whole","date_system":"1900"}

{"sheet":"様式1号（基本情報）","index":0,"n_rows":40,"n_cols":8,"rows_kept":40,"cut":false,"hidden":false,"merged":[[10,0,10,1],[10,2,10,5],[0,0,0,5],[6,0,6,5],[8,0,8,5],[9,0,9,1],[9,2,9,5],[15,0,15,1],[15,2,15,5],[19,0,19,1],[19,2,19,5],[18,0,18,1],[18,2,18,5],[16,0,17,1],[16,2,17,5],[11,0,11,1],[11,2,11,5],[12,0,12,1],[12,2,12,5],[13,0,14,1],[13,2,13,5],[14,2,14,5],[26,2,26,5],[20,0,21,1],[21,2,21,5],[22,0,23,1],[23,2,23,5],[24,0,24,1],[24,2,24,5],[25,0,25,1],[25,2,25,5],[26,0,26,1],[39,1,39,5],[30,0,30,5],[31,1,31,5],[32,1,32,5],[34,1,34,5],[35,1,35,5],[36,1,36,5],[37,1,37,5],[38,1,38,5],[33,1,33,5],[27,0,27,1],[27,2,27,5],[28,0,28,1],[28,2,28,5],[29,0,29,1],[29,2,29,5]]}
["豊田市SDGs認証　申請書"]
[]
[]
["申請日",null,null,null,null,"第3回様式 修正"]
[]
[]
["宣言：私たちは、豊田市SDGs認証に当たり申請書類に記載した取組について現在まで継続し、一層取組を向上しています。認証を取得した場合、認証事業者として、今回記載した内容をはじめとする先進的な取組をさらに進めていきます。"]
[]
["■申請者の概要",null,null,null,null,null,null,"\n"]
["フリガナ"]
{"$rows_left_out":31}
{"sheet":"様式2号（認証チェックシート）","index":1,"n_rows":93,"n_cols":14,"rows_kept":93,"cut":false,"hidden":false,"merged":[[26,13,30,13],[24,1,25,1],[24,2,25,2],[24,3,25,3],[24,11,25,11],[14,13,16,13],[12,12,13,13],[13,4,13,5],[22,1,23,1],[22,2,23,2],[22,3,23,3],[22,11,23,11],[20,3,21,3],[17,1,21,1],[17,2,21,2],[17,3,19,3],[14,1,16,1],[14,2,16,2],[14,3,15,3],[14,11,16,11],[17,11,19,11],[31,1,32,1],[31,2,32,2],[31,3,32,3],[31,11,32,11],[33,11,35,11],[36,11,39,11],[26,1,30,1],[26,2,30,2],[26,3,30,3],[26,11,30,11],[45,1,50,1],[45,2,50,2],[45,3,47,3],[48,3,50,3],[40,1,44,1],[40,2,44,2],[40,11,44,11],[33,1,39,1],[33,2,39,2],[33,3,35,3],[36,3,39,3],[40,3,43,3],[57,1,59,1],[57,2,59,2],[57,3,59,3],[57,11,59,11],[55,1,56,1],[55,2,56,2],[55,3,56,3],[55,11,56,11],[51,1,54,1],[51,2,54,2],[51,3,54,3],[51,11,54,11],[68,1,70,1],[68,2,70,2],[68,3,70,3],[68,11,70,11],[64,1,67,1],[64,2,67,2],[64,3,67,3],[64,11,67,11],[60,1,63,1],[60,2,63,2],[60,3,61,3],[60,11,63,11],[62,3,63,3],[80,13,81,13],[75,1,76,1],[75,2,76,2],[75,3,76,3],[75,11,76,11],[80,11,81,11],[71,1,74,1],[71,2,74,2],[71,3,74,3],[71,11,74,11],[2,1,2,14],[9,1,9,14],[20,11,21,11],[45,11,47,11],[48,11,50,11],[90,1,92,1],[90,2,92,2],[90,3,92,3],[90,11,92,11],[90,13,92,13],[86,1,89,1],[86,2,89,2],[86,11,89,11],[87,3,89,3],[82,1,83,1],[82,2,83,2],[82,3,83,3],[82,11,83,11],[77,1,81,1],[77,2,81,2],[77,3,79,3],[77,11,79,11],[80,3,81,3],[80,12,81,12]]}
[null,null,null,null,null,null,null,null,null,null,null,null,null,{"$f":"'様式1号（基本情報）'!F4","v":"第3回様式 修正"}]
[null,null,null,null,null,null,null,null,null,null,null,null,null,{"$f":"'様式1号（基本情報）'!$C$11","v":0}]
[null,"豊田市SDGs認証　認証チェックシート"]
[]
[null,"豊田市の以下の制度のうち、表彰実績がある／参加しているものがありましたら、表彰を受けた年／参加した年をご記入ください。（複数回表彰実績がある場合は、直近の実績をご記入ください。）"]
[]
[null,null,"・豊田市はたらく人がイキイキ輝く事業所表彰",null,null,"【受賞の種類（チェック）　　　大賞　　　優秀賞　　　　イキイキ賞　　　　部門賞　表彰を受けた年：　　　　　　】　※令和３年度～令和５年度の受賞実績に限る"]
[null,null,"　※表彰による自動配点",null,null,"【　　希望する】 （自動配点を希望された場合、S1-S5のチェック／記述は一切不要となる代わり、一定の想定点数が付与されます）"]
[null,null,"・豊田市脱炭素スクール",null,null,"【　　修了実績がある　／修了した年：　　　　　　】"]
[null,"各評価項目について、実施している項目があればチェックをつけてください。（複数選択可）\nチェックを付けた取組について、具体的な取組内容やその実績などを「記述欄」にご記入ください（原則300文字以内）。なお、大項目やチェックの状況などによって、記述欄に記載が求められる内容は異なります。（【取得している認証】【取組の成果】　など）\n　　※複数の取組を実施している場合は、文字数制限の範囲内でなるべく複数の取組についてご記載ください。\n　　※【取組の成果】については、取組前と比べて改善した各種指標や数値なども含めてご記入ください。また、具体的な数値実績を把握していない・取組を始めたばかりでまだ実績が出ていないなどの場合には、記入しなくても構いません。"]
{"$rows_left_out":84}
{"sheet":"様式3号（今後の重点目標）","index":2,"n_rows":21,"n_cols":10,"rows_kept":21,"cut":false,"hidden":false,"merged":[[22,1,22,9],[2,1,2,10],[12,1,12,10],[13,8,14,10],[20,1,20,10],[19,8,19,10],[13,1,13,3],[15,8,15,10],[13,6,13,7],[16,8,16,10],[17,8,17,10],[18,8,18,10],[13,5,14,5],[13,4,14,4],[5,2,5,4],[6,2,6,4],[7,2,7,4],[8,2,8,4],[9,2,9,4]]}
[null,null,null,null,null,null,null,null,null,{"$f":"'様式1号（基本情報）'!F4","v":"第3回様式 修正"}]
[null,null,null,null,null,null,null,null,null,{"$f":"'様式1号（基本情報）'!C11","v":0}]
[null,"豊田市SDGs認証　今後の重点目標"]
[null,"重点的に取り組むゴール番号"]
[null,"今後、貴社が重点的に取り組むゴールについて、最低1つ、最大5つをプルダウンから選択してください。"]
[null,"①"]
[null,"②"]
[null,"③"]
[null,"④"]
[null,"⑤"]
{"$rows_left_out":12}
{"sheet":"【評価】_②認証チェックシート","index":3,"n_rows":133,"n_cols":44,"rows_kept":133,"cut":false,"hidden":true,"merged":[[34,43,38,43],[34,12,38,12],[100,25,103,25],[100,26,103,26],[101,24,103,24],[104,24,109,24],[104,25,109,25],[104,26,109,26],[21,24,23,24],[21,25,23,25],[21,26,26,26],[24,24,26,24],[24,25,26,25],[27,24,29,24],[27,25,29,25],[27,26,29,26],[104,14,106,14],[98,26,99,26],[93,12,94,12],[93,13,94,13],[93,14,94,14],[100,40,103,40],[100,42,103,42],[100,43,103,43],[101,3,103,3],[101,17,103,17],[101,27,103,27],[101,34,103,34],[132,1,132,3],[132,4,132,6],[132,12,132,14],[104,28,109,28],[104,29,109,29],[104,34,109,34],[104,35,109,35],[104,36,109,36],[104,40,109,40],[104,17,109,17],[104,18,109,18],[104,19,109,19],[104,27,109,27],[104,1,109,1],[104,2,109,2],[104,3,109,3],[104,12,109,12],[104,42,109,42],[104,43,109,43],[106,5,109,5],[106,20,109,20],[106,30,109,30],[98,43,99,43],[100,1,103,1],[100,2,103,2],[100,12,103,12],[100,18,103,18],[100,19,103,19],[100,28,103,28],[100,29,103,29],[98,30,99,30],[98,34,99,34],[98,35,99,35],[98,36,99,36],[98,40,99,40],[98,42,99,42],[98,18,99,18],[98,19,99,19],[98,27,99,27],[100,35,103,35],[100,36,103,36],[98,28,99,28],[98,29,99,29],[98,20,99,20],[98,24,99,24],[98,25,99,25],[98,1,99,1],[98,2,99,2],[98,3,99,3],[98,5,99,5],[98,12,99,12],[98,17,99,17],[95,34,96,34],[95,35,96,35],[95,36,96,36],[95,1,96,1],[95,2,96,2],[90,40,92,40],[90,42,92,42],[90,43,92,43],[93,3,94,3],[95,40,96,40],[95,42,96,42],[95,43,96,43],[95,17,96,17],[95,18,96,18],[95,19,96,19],[95,27,96,27],[95,28,96,28],[95,29,96,29],[95,24,96,24],[95,25,96,25],[95,26,96,26],[95,3,96,3],[95,12,96,12],[90,35,92,35],[90,19,94,19],[88,43,89,43],[90,1,94,1],[90,2,94,2],[90,3,92,3],[90,12,92,12],[90,17,92,17],[90,18,92,18],[88,29,89,29],[88,34,89,34],[88,35,89,35],[88,36,89,36],[88,40,89,40],[88,42,89,42],[93,40,94,40],[93,42,94,42],[90,24,92,24],[90,25,92,25],[90,26,94,26],[93,24,94,24],[93,25,94,25],[90,36,94,36],[88,25,89,25],[88,26,89,26],[84,40,87,40],[84,42,87,42],[84,43,87,43],[84,29,87,29],[84,34,87,34],[84,35,87,35],[93,43,94,43],[93,27,94,27],[93,28,94,28],[93,34,94,34],[93,35,94,35],[84,36,87,36],[90,27,92,27],[90,28,92,28],[90,29,94,29],[90,34,92,34],[88,1,89,1],[88,2,89,2],[88,3,89,3],[88,12,89,12],[84,19,87,19],[84,27,87,27],[84,28,87,28],[84,24,87,24],[84,25,87,25],[84,26,87,26],[88,17,89,17],[88,18,89,18],[88,19,89,19],[88,27,89,27],[88,28,89,28],[88,24,89,24],[93,17,94,17],[93,18,94,18],[76,19,80,19],[76,27,80,27],[76,28,80,28],[76,24,80,24],[81,43,83,43],[84,1,87,1],[84,2,87,2],[84,3,87,3],[84,12,87,12],[84,17,87,17],[84,18,87,18],[81,29,83,29],[81,34,83,34],[81,35,83,35],[81,36,83,36],[81,40,83,40],[81,42,83,42],[81,17,83,17],[81,18,83,18],[81,19,83,19],[81,27,83,27],[76,43,80,43],[79,5,80,5],[79,20,80,20],[79,30,80,30],[81,1,83,1],[81,2,83,2],[81,3,83,3],[81,12,83,12],[76,29,80,29],[76,34,80,34],[76,1,80,1],[76,2,80,2],[76,3,80,3],[76,12,80,12],[81,28,83,28],[81,26,83,26],[76,35,80,35],[76,36,80,36],[76,40,80,40],[76,42,80,42],[76,17,80,17],[76,18,80,18],[81,24,83,24],[81,25,83,25],[76,25,80,25],[76,26,80,26],[69,28,71,28],[69,24,71,24],[69,25,71,25],[72,40,75,40],[72,42,75,42],[72,43,75,43],[74,3,75,3],[74,17,75,17],[74,27,75,27],[74,34,75,34],[72,24,73,24],[72,19,75,19],[72,27,73,27],[72,28,75,28],[72,29,75,29],[72,34,73,34],[72,35,75,35],[72,25,75,25],[72,26,75,26],[74,24,75,24],[69,26,71,26],[72,36,75,36],[69,1,71,1],[69,2,71,2],[69,3,71,3],[69,12,71,12],[65,36,68,36],[65,40,68,40],[69,43,71,43],[72,1,75,1],[72,2,75,2],[72,3,73,3],[72,12,75,12],[72,17,73,17],[72,18,75,18],[69,29,71,29],[69,34,71,34],[69,35,71,35],[69,36,71,36],[69,40,71,40],[69,42,71,42],[69,17,71,17],[69,18,71,18],[69,19,71,19],[69,27,71,27],[66,30,68,30],[67,43,68,43],[65,24,68,24],[65,25,68,25],[65,19,68,19],[65,27,68,27],[65,28,68,28],[65,29,68,29],[65,34,68,34],[65,35,68,35],[65,26,68,26],[61,43,64,43],[65,1,68,1],[65,2,68,2],[65,3,68,3],[65,12,68,12],[65,17,68,17],[65,18,68,18],[61,29,64,29],[61,34,64,34],[61,35,64,35],[61,36,64,36],[61,40,64,40],[61,42,64,42],[61,17,64,17],[61,18,64,18],[61,19,64,19],[61,27,64,27],[61,28,64,28],[61,24,64,24],[61,25,64,25],[65,42,66,42],[65,43,66,43],[66,5,68,5],[66,20,68,20],[55,43,57,43],[58,3,60,3],[58,12,60,12],[58,17,60,17],[58,27,60,27],[58,34,60,34],[58,40,60,40],[58,42,60,42],[58,43,60,43],[55,33,57,33],[55,34,57,34],[55,35,60,35],[55,36,60,36],[55,40,57,40],[55,42,57,42],[55,19,60,19],[55,31,57,31],[55,32,57,32],[55,24,57,24],[55,25,60,25],[55,26,60,26],[58,24,60,24],[55,29,60,29],[43,17,45,17],[50,26,54,26],[61,26,64,26],[61,1,64,1],[61,2,64,2],[61,3,64,3],[61,12,64,12],[50,36,54,36],[55,1,60,1],[55,2,60,2],[55,3,57,3],[55,12,57,12],[55,17,57,17],[55,18,60,18],[50,19,54,19],[50,27,53,27],[50,28,54,28],[50,24,53,24],[50,25,54,25],[55,27,57,27],[55,28,60,28],[46,12,49,12],[46,17,49,17],[46,18,49,18],[46,43,49,43],[50,1,54,1],[50,2,54,2],[50,3,53,3],[50,12,54,12],[50,17,53,17],[50,18,54,18],[43,1,49,1],[43,2,49,2],[43,3,45,3],[43,12,45,12],[50,43,54,43],[50,33,52,33],[50,34,53,34],[50,35,54,35],[43,42,45,42],[50,40,54,40],[50,42,54,42],[43,43,45,43],[50,29,54,29],[50,31,52,31],[50,32,52,32],[46,42,49,42],[46,3,49,3],[46,34,49,34],[43,29,49,29],[43,21,45,21],[43,22,45,22],[43,23,45,23],[43,31,45,31],[43,32,45,32],[43,24,45,24],[43,25,45,25],[43,26,49,26],[46,24,49,24],[43,28,45,28],[39,42,42,42],[39,43,42,43],[40,5,42,5],[40,20,42,20],[40,30,42,30],[39,24,42,24],[39,25,42,25],[39,18,42,18],[39,19,42,19],[39,27,42,27],[39,28,42,28],[39,29,42,29],[39,34,42,34],[39,26,42,26],[34,40,38,40],[34,17,38,17],[34,18,38,18],[34,19,38,19],[34,27,38,27],[34,24,38,24],[34,25,38,25],[34,26,38,26],[46,25,49,25],[39,35,42,35],[39,36,42,36],[39,40,42,40],[43,33,45,33],[43,34,45,34],[43,35,45,35],[43,36,49,36],[43,40,45,40],[46,35,49,35],[46,40,49,40],[43,18,45,18],[43,19,49,19],[43,27,45,27],[46,27,49,27],[46,28,49,28],[39,1,42,1],[39,2,42,2],[39,3,42,3],[39,12,42,12],[39,17,42,17],[34,28,38,28],[34,29,38,29],[34,34,38,34],[34,35,38,35],[30,43,33,43],[31,5,33,5],[31,20,33,20],[31,30,33,30],[34,1,37,1],[34,2,37,2],[34,3,37,3],[34,14,37,14],[30,29,33,29],[30,34,33,34],[30,35,33,35],[30,36,33,36],[30,40,33,40],[30,42,33,42],[30,17,33,17],[30,18,33,18],[30,19,33,19],[30,27,33,27],[30,28,33,28],[30,24,33,24],[30,25,33,25],[30,26,33,26],[34,42,37,42],[34,36,38,36],[30,1,33,1],[30,2,33,2],[30,3,33,3],[30,12,33,12],[27,29,29,29],[27,34,29,34],[27,35,29,35],[27,17,29,17],[27,18,29,18],[27,19,29,19],[27,27,29,27],[27,28,29,28],[27,1,29,1],[27,2,29,2],[27,3,29,3],[27,12,29,12],[24,35,26,35],[24,40,26,40],[24,42,26,42],[24,43,26,43],[25,5,26,5],[25,20,26,20],[25,30,26,30],[27,43,29,43],[28,5,29,5],[28,20,29,20],[28,30,29,30],[27,36,29,36],[27,40,29,40],[27,42,29,42],[24,3,26,3],[24,12,26,12],[24,17,26,17],[21,18,23,18],[21,19,26,19],[21,27,23,27],[21,28,23,28],[21,29,26,29],[21,34,23,34],[24,18,26,18],[24,27,26,27],[24,28,26,28],[24,34,26,34],[18,42,20,42],[18,43,20,43],[21,1,26,1],[21,2,26,2],[21,3,23,3],[21,12,23,12],[21,17,23,17],[18,28,20,28],[18,29,20,29],[18,34,19,34],[18,35,20,35],[18,36,20,36],[18,40,20,40],[18,17,19,17],[18,18,20,18],[18,19,20,19],[18,27,19,27],[18,24,19,24],[18,25,20,25],[21,35,23,35],[21,36,26,36],[21,40,23,40],[21,42,23,42],[21,43,23,43],[18,26,20,26],[16,31,16,33],[16,38,16,39],[17,4,17,5],[17,38,17,39],[18,1,20,1],[18,2,20,2],[18,3,19,3],[18,12,20,12],[18,14,20,14],[16,18,17,18],[16,19,17,19],[16,27,17,27],[16,28,17,28],[16,29,17,29],[16,21,16,23],[16,11,17,11],[16,13,17,14],[16,17,17,17],[0,17,0,19],[0,27,0,29],[0,20,0,23],[0,30,0,33],[0,39,0,41],[2,1,2,14],[0,34,0,36],[0,24,0,26],[2,21,2,22],[2,31,2,32]]}
[null,null,null,null,null,null,null,null,null,null,null,null,{"$f":"'様式1号（基本情報）'!C11:F11","v":0},0,0,0,null,"【満点（全て記載）】",null,null,"<非表示：計算用（全て記載）＞",null,null,null,"【採点結果】",null,null,"【自動配点の場合の最高得点】",null,null,"<非表示：計算用（自動配点）＞",null,null,null,"【採点結果（自動配点）】",null,null,false]
[null,null,null,null,null,null,null,null,null,null,null,null,null,null,null,null,null,"　",null,null,null,null,null,null,null,null,null,"　"]
[null,"豊田市SDGs認証　認証チェックシート",null,null,null,null,null,null,null,null,null,null,null,null,null,null,null,"チェック計","加点計","合計","チェック計","加点計算用",null,"加点計","チェック計","加点計","合計","チェック計","加点計","合計","チェック計","加点計算用",null,"加点計","チェック計","加点計","合計"]
[null,null,null,null,null,null,null,null,null,null,null,null,{"$f":"'様式1号（基本情報）'!F4","v":"第3回様式 修正"},null,null,null,"E",{"$f":"SUM(R19:R43)","v":25},{"$f":"SUM(S19:S43)","v":30},{"$f":"R4+S4","v":55},{"$f":"SUM(U19:U41)","v":0},{"$f":"SUM(V19:V41)","v":0},{"$f":"SUM(W19:W43)","v":36},{"$f":"SUM(X19:X43)","v":0},{"$f":"IF(AL1=FALSE,(SUM(Y19:Y43)),0)","v":0},{"$f":"IF(AL1=FALSE,(SUM(Z19:Z43)),0)","v":0},{"$f":"Y4+Z4","v":0},{"$f":"SUM(AB19:AB41)","v":25},{"$f":"SUM(AC19:AC41)","v":30},{"$f":"AB4+AC4","v":55},{"$f":"SUM(AE19:AE41)","v":0},{"$f":"SUM(AF19:AF41)","v":0},{"$f":"SUM(AG19:AG43)","v":36},{"$f":"SUM(AH19:AH43)","v":0},{"$f":"IF(AL1=TRUE,(SUM(AI19:AI43)),0)","v":0},{"$f":"IF(AL1=TRUE,(SUM(AJ19:AJ43)),0)","v":0},{"$f":"AI4+AJ4","v":0}]
[null,"豊田市の以下の制度のうち、表彰実績がある／参加しているものがありましたら、表彰を受けた年／参加した年をご記入ください。（複数回表彰実績がある場合は、直近の実績をご記入ください。）",null,null,null,null,null,null,null,null,null,null,null,null,null,null,"S",{"$f":"SUM(R44:R81)","v":41},{"$f":"SUM(S44:S81)","v":32},{"$f":"R5+S5","v":73},{"$f":"SUM(U44:U80)","v":0},{"$f":"SUM(V44:V80)","v":0},{"$f":"SUM(W44:W81)","v":35},{"$f":"SUM(X44:X81)","v":0},{"$f":"IF(AL1=FALSE,(SUM(Y44:Y81)),0)","v":0},{"$f":"IF(AL1=FALSE,(SUM(Z44:Z81)),0)","v":0},{"$f":"Y5+Z5","v":0},{"$f":"R5","v":41},{"$f":"S5","v":32},{"$f":"AB5+AC5","v":73},{"$f":"SUM(AE44:AE80)","v":0},{"$f":"SUM(AF44:AF80)","v":0},{"$f":"SUM(AG44:AG81)","v":11},{"$f":"SUM(AH44:AH81)","v":0},{"$f":"IF(AL1=TRUE,(SUM(AI44:AI81)+AF8),0)","v":0},{"$f":"IF(AL1=TRUE,(SUM(AJ44:AJ81)+AG8),0)","v":0},{"$f":"AI5+AJ5","v":0}]
[null,null,"・はたらく人がイキイキ輝く事業所表彰",null,null,"【受賞の種類（チェック）　　　大賞　　　優秀賞　　　　イキイキ賞　　　　部門賞　表彰を受けた年：　　　　　　】　※直近3年以内の受賞に限る",null,null,null,null,null,null,null,null,null,null,"G",{"$f":"SUM(R82:R97)","v":17},{"$f":"SUM(S82:S97)","v":13},{"$f":"R6+S6","v":30},{"$f":"SUM(U82:U97)","v":0},0,13,0,{"$f":"IF(AL1=FALSE,(SUM(Y82:Y97)),0)","v":0},{"$f":"IF(AL1=FALSE,(SUM(Z82:Z97)),0)","v":0},{"$f":"Y6+Z6","v":0},{"$f":"SUM(AB82:AB97)","v":17},{"$f":"SUM(AC82:AC97)","v":13},30,0,0,13,0,{"$f":"IF(AL1=TRUE,(SUM(AI82:AI97)),0)","v":0},{"$f":"IF(AL1=TRUE,(SUM(AJ82:AJ97)),0)","v":0},{"$f":"AI6+AJ6","v":0}]
[null,null,"　※表彰による自動配点",null,null,"【　　希望する】",null,null,null,null,null,null,null,null,null,null,"L",{"$f":"SUM(R98:R110)","v":24},{"$f":"SUM(S98:S110)","v":17},{"$f":"R7+S7","v":41},{"$f":"SUM(U98:U110)","v":0},{"$f":"SUM(V98:V107)","v":0},{"$f":"SUM(W98:W110)","v":23},{"$f":"SUM(X98:X110)","v":0},{"$f":"IF(AL1=FALSE,(SUM(Y98:Y107)),0)","v":0},{"$f":"IF(AL1=FALSE,(SUM(Z98:Z107)),0)","v":0},{"$f":"Y7+Z7","v":0},{"$f":"SUM(AB98:AB110)","v":24},{"$f":"SUM(AC98:AC107)","v":17},41,{"$f":"SUM(AE98:AE110)","v":0},{"$f":"SUM(AF98:AF107)","v":0},{"$f":"SUM(AG98:AG110)","v":23},{"$f":"SUM(AH98:AH110)","v":0},{"$f":"IF(AL1=TRUE,(SUM(AI98:AI107)),0)","v":0},{"$f":"IF(AL1=TRUE,(SUM(AJ98:AJ107)),0)","v":0},{"$f":"AI7+AJ7","v":0}]
[null,null,"・豊田市脱炭素スクール",null,null,"【　　参加実績がある　／参加した年：】",null,null,null,null,null,null,null,null,null,null,"貴市制度（最大）",null,{"$f":"S9+S13","v":8},{"$f":"R8+S8","v":8},null,null,{"$f":"SUM(W9:W13)","v":0},{"$f":"W8","v":0},null,{"$f":"IF(AL1=FALSE,W8,0)","v":0},{"$f":"Y8+Z8","v":0},null,{"$f":"AC13","v":3},{"$f":"AC8","v":3},null,{"$f":"SUM(AF9:AF12)","v":0},{"$f":"SUM(AG9:AG12)","v":0},null,null,{"$f":"IF(AL1=TRUE,AG13,0)","v":0},{"$f":"AI8+AJ8","v":0}]
[null,null,null,null,null,null,null,null,null,null,null,null,null,null,null,null,"大賞",null,5,null,false,5,{"$f":"IFERROR(VLOOKUP(TRUE,U9:V9,2,FALSE),0)","v":0},null,null,null,null,21,18,null,null,{"$f":"IFERROR(VLOOKUP(TRUE,U9:AG9,8,FALSE),0)","v":0},{"$f":"IFERROR(VLOOKUP(TRUE,U9:AG9,9,FALSE),0)","v":0}]
[null,null,null,null,null,null,null,null,null,null,null,null,null,null,null,null,"優秀賞",null,4,null,false,4,{"$f":"IFERROR(VLOOKUP(TRUE,U10:V10,2,FALSE),0)","v":0},null,null,null,null,17,14,null,null,{"$f":"IFERROR(VLOOKUP(TRUE,U10:AG10,8,FALSE),0)","v":0},{"$f":"IFERROR(VLOOKUP(TRUE,U10:AG10,9,FALSE),0)","v":0}]
{"$rows_left_out":124}
{"sheet":"【評価】診断結果計算シート","index":4,"n_rows":29,"n_cols":19,"rows_kept":29,"cut":false,"hidden":true,"merged":[[3,12,3,14],[3,7,3,10],[3,15,3,18],[3,4,3,6]]}
[null,null,"豊田市SDGs認証チェックシート"]
[]
[]
[null,null,null,null,"満点（全て記載）",null,null,"【採点結果（全て記載）】",null,null,null,null,"満点（自動配点）",null,null,"【採点結果（自動配点）】"]
[null,null,null,null,"チェック計","加点計","合計","チェック計","加点計","合計","判定",null,"チェック計","加点計","合計","チェック計","加点計","合計","判定"]
[null,null,null,"環境",{"$f":"【評価】_②認証チェックシート!R4","v":25},{"$f":"【評価】_②認証チェックシート!S4","v":30},{"$f":"【評価】_②認証チェックシート!T4","v":55},{"$f":"【評価】_②認証チェックシート!Y4","v":0},{"$f":"【評価】_②認証チェックシート!Z4","v":0},{"$f":"【評価】_②認証チェックシート!AA4","v":0},{"$f":"J6/G6","v":0},"環境",{"$f":"【評価】_②認証チェックシート!AB4","v":25},{"$f":"【評価】_②認証チェックシート!AC4","v":30},{"$f":"【評価】_②認証チェックシート!AD4","v":55},{"$f":"【評価】_②認証チェックシート!AI4","v":0},{"$f":"【評価】_②認証チェックシート!AJ4","v":0},{"$f":"【評価】_②認証チェックシート!AK4","v":0},{"$f":"R6/O6","v":0}]
[null,null,null,"社会",{"$f":"【評価】_②認証チェックシート!R5","v":41},{"$f":"【評価】_②認証チェックシート!S5","v":32},{"$f":"【評価】_②認証チェックシート!T5","v":73},{"$f":"【評価】_②認証チェックシート!Y5","v":0},{"$f":"【評価】_②認証チェックシート!Z5","v":0},{"$f":"【評価】_②認証チェックシート!AA5","v":0},{"$f":"J7/G7","v":0},"社会",{"$f":"【評価】_②認証チェックシート!AB5","v":41},{"$f":"【評価】_②認証チェックシート!AC5","v":32},{"$f":"【評価】_②認証チェックシート!AD5","v":73},{"$f":"【評価】_②認証チェックシート!AI5","v":0},{"$f":"【評価】_②認証チェックシート!AJ5","v":0},{"$f":"【評価】_②認証チェックシート!AK5","v":0},{"$f":"R7/O7","v":0}]
[null,null,null,"ガバナンス",{"$f":"【評価】_②認証チェックシート!R6","v":17},{"$f":"【評価】_②認証チェックシート!S6","v":13},{"$f":"【評価】_②認証チェックシート!T6","v":30},{"$f":"【評価】_②認証チェックシート!Y6","v":0},{"$f":"【評価】_②認証チェックシート!Z6","v":0},{"$f":"【評価】_②認証チェックシート!AA6","v":0},0,"ガバナンス",{"$f":"【評価】_②認証チェックシート!AB6","v":17},{"$f":"【評価】_②認証チェックシート!AC6","v":13},{"$f":"【評価】_②認証チェックシート!AD6","v":30},{"$f":"【評価】_②認証チェックシート!AI6","v":0},{"$f":"【評価】_②認証チェックシート!AJ6","v":0},{"$f":"【評価】_②認証チェックシート!AK6","v":0},0]
[null,null,null,"地域",{"$f":"【評価】_②認証チェックシート!R7","v":24},{"$f":"【評価】_②認証チェックシート!S7","v":17},{"$f":"【評価】_②認証チェックシート!T7","v":41},{"$f":"【評価】_②認証チェックシート!Y7","v":0},{"$f":"【評価】_②認証チェックシート!Z7","v":0},{"$f":"【評価】_②認証チェックシート!AA7","v":0},{"$f":"J9/G9","v":0},"地域",{"$f":"【評価】_②認証チェックシート!AB7","v":24},{"$f":"【評価】_②認証チェックシート!AC7","v":17},{"$f":"【評価】_②認証チェックシート!AD7","v":41},{"$f":"【評価】_②認証チェックシート!AI7","v":0},{"$f":"【評価】_②認証チェックシート!AJ7","v":0},{"$f":"【評価】_②認証チェックシート!AK7","v":0},{"$f":"R9/O9","v":0}]
[null,null,null,"市制度（最大）",null,{"$f":"【評価】_②認証チェックシート!S8","v":8},{"$f":"【評価】_②認証チェックシート!T8","v":8},{"$f":"【評価】_②認証チェックシート!Y8","v":0},{"$f":"【評価】_②認証チェックシート!Z8","v":0},{"$f":"【評価】_②認証チェックシート!AA8","v":0},null,"市制度（最大）",{"$f":"【評価】_②認証チェックシート!AB8","v":0},{"$f":"【評価】_②認証チェックシート!AC8","v":3},{"$f":"【評価】_②認証チェックシート!AD8","v":3},{"$f":"【評価】_②認証チェックシート!AI8","v":0},{"$f":"【評価】_②認証チェックシート!AJ8","v":0},{"$f":"【評価】_②認証チェックシート!AK8","v":0}]
{"$rows_left_out":20}
{"sheet":"【評価】第4号様式_結果通知書","index":5,"n_rows":35,"n_cols":20,"rows_kept":35,"cut":false,"hidden":true,"merged":[[27,2,27,8],[27,12,27,18],[29,2,31,8],[29,12,31,18],[25,2,25,8],[25,12,25,18],[26,2,26,8],[26,12,26,18],[11,3,11,7],[11,13,11,17],[24,2,24,8],[24,12,24,18],[6,2,6,8],[6,12,6,18],[8,2,9,8],[8,12,9,18],[10,3,10,7],[10,13,10,17]]}
[]
[null,"（様式第４号）"]
[]
[null,null,null,null,null,null,null,null,null,"年　　月　　日"]
[]
[]
[null,null,"豊田市ＳＤＧｓ認証　評価結果のお知らせ",null,null,null,null,null,null,null,null,null,"豊田市SDGs認証　評価結果のお知らせ"]
[]
[null,null,{"$f":"M9","v":"　明治３３年１月０日付けで申請がありました、豊田市ＳＤＧｓ認証の評価結果が確定いたしましたのでお知らせ致します。"},null,null,null,null,null,null,null,null,null,{"$f":"\"　\"&DBCS(TEXT('様式1号（基本情報）'!D4,\"ggge年m月d日\"))&\"付けで申請がありました、豊田市ＳＤＧｓ認証の評価結果が確定いたしましたのでお知らせ致します。\"","v":"　明治３３年１月０日付けで申請がありました、豊田市ＳＤＧｓ認証の評価結果が確定いたしましたのでお知らせ致します。"}]
[]
{"$rows_left_out":26}
{"sheet":"（非表示シート）BCI列プルダウン","index":6,"n_rows":48,"n_cols":10,"rows_kept":48,"cut":false,"hidden":true,"merged":[]}
[null,"B列　ID・分類",null,"C列　ID・分類","D列1","D列2",null,"D列9行",null,"ゴール"]
[null,"TY-E-1　環境マネジメント・コミュニケーション",null,"E-1　環境マネジメント・コミュニケーション","●環境マネジメント体制を構築している。","●自社の環境への取り組みを開示している。",null,{"$f":"IF('様式3号（今後の重点目標）'!$C$18=\"\",\"\",VLOOKUP('様式3号（今後の重点目標）'!$C$18,$D$2:$F$48,2,FALSE))","v":""},null,"1　貧困をなくそう"]
[null,"TY-E-2　気候変動（脱炭素）への取り組み",null,"E-2　気候変動（脱炭素）への取り組み","●脱炭素に向けて、省エネに取り組んでいる。","●脱炭素に向けて再生可能エネルギーの利用を進めている。",null,{"$f":"IF('様式3号（今後の重点目標）'!$C$18=\"\",\"\",VLOOKUP('様式3号（今後の重点目標）'!$C$18,$D$2:$F$48,3,FALSE))","v":""},null,"2　飢餓をゼロに"]
[null,"TY-E-3　水の効率的な利用・管理",null,"E-3　水の効率的な利用・管理","●水の効率的な利用・管理を行っている"," ",null,null,null,"3　すべての人に健康と福祉を"]
[null,"TY-E-4　廃棄物・有害化学物質の管理・３Rの推進",null,"E-4　廃棄物・有害化学物質の管理・３Rの推進","●廃棄物・有害化学物質を適切に管理している。"," ",null,"D列10行",null,"4　質の高い教育をみんなに"]
[null,"TY-E-5　天然資源・生物多様性への配慮",null,"E-5　天然資源・生物多様性への配慮","●天然資源や生物多様性へ配慮している。"," ",null,{"$f":"IF('様式3号（今後の重点目標）'!$C$19=\"\",\"\",VLOOKUP('様式3号（今後の重点目標）'!$C$19,$D$2:$F$48,2,FALSE))","v":""},null,"5　ジェンダー平等を実現しよう"]
[null,"TY-E-6　製品・サービスを通じた環境問題の解決",null,"E-6　製品・サービスを通じた環境問題の解決","●製品・サービスの提供を通じて環境問題の改善に貢献している。"," ",null,{"$f":"IF('様式3号（今後の重点目標）'!$C$19=\"\",\"\",VLOOKUP('様式3号（今後の重点目標）'!$C$19,$D$2:$F$48,3,FALSE))","v":""},null,"6　安全な水とトイレを世界中に"]
[null,"TY-S-1　安全・衛生管理、健康経営",null,"S-1　安全・衛生管理、健康経営","●職場における安全・衛生管理に取り組んでいる。","●健康経営に取り組んでいる",null,null,null,"7　エネルギーをみんなに そしてクリーンに"]
[null,"TY-S-2　多様な人材の活躍",null,"S-2　多様な人材の活躍","●外国人、障がい者、高齢者等、社内の多様な人材の活躍支援に関する取り組みがある。","●社内のハラスメントを防止するための取り組みを進めている。",null,"D列11行",null,"8　働きがいも経済成長も"]
[null,"TY-S-3　女性の活躍促進",null,"S-3　女性の活躍促進","●女性の活躍支援に向けた目標を設定している。","●女性の活躍を支援するための取り組みがある。",null,{"$f":"IF('様式3号（今後の重点目標）'!$C$20=\"\",\"\",VLOOKUP('様式3号（今後の重点目標）'!$C$20,$D$2:$F$48,2,FALSE))","v":""},null,"9　産業と技術革新の基盤をつくろう"]
{"$rows_left_out":38}